{"text_format":"1","workbook":"xlsx","n_sheets":10,"sheets":["Tax Table","Extension Form","Social Security Worksheet","HSA Contribution Deduction Lmts","Deduction Worksheet for SE","IRS COLA Limits","Stud Loan Int & Tuition & Fees ","Dropdowns","Child Tax Credit Form","AMT"],"not_rendered":{"charts":0,"images":7,"macros":1,"external_links":0,"defined_names":1,"comments":0,"pivot_tables":0},"unopened":[],"bounds":{"document_bytes":16777216,"sheet_cells":100000,"rows_first":2000,"rows_last":500,"rows_between":2000,"halvings":0,"cell_chars":16384,"cell_head_chars":4096},"cells_cut":0,"cells_raw":0,"read":"whole","date_system":"1900"}

{"sheet":"Tax Table","index":0,"n_rows":67,"n_cols":14,"rows_kept":67,"cut":false,"hidden":true,"merged":[[46,2,51,2],[44,0,44,3],[0,13,0,14],[65,3,65,6],[66,4,66,5],[61,4,61,5],[62,4,62,5],[63,4,63,5],[60,3,60,6],[0,5,0,6]]}
["Federal Tax Table 2014","Blue is Changeable",null,"Tax is","Of Amt. Over","Income Tax Calculated for WITH Tuition Deduction",null,null,null,null,null,null,null,"Income Tax Calculated for without Tuition Deduction"]
[null,null,null,null,null,"Federal Income Tax",{"$f":"'Extension Form'!F66","v":-10000},null,null,null,null,null,"Federal Income Tax",{"$f":"'Extension Form'!E66","v":-10000}]
[0,8925,0.1,null,0,{"$f":"IF(G$2>0,IF(G$2>$B3,$C3*$B3,G$2*$C3),0)","v":0},null,0,8925,0.1,null,0,{"$f":"IF(N$2>0,IF(N$2>$B3,$C3*$B3,N$2*$C3),0)","v":0}]
[{"$f":"B3+1","v":8926},36250,0.15,{"$f":"C3*B3","v":892.5},{"$f":"B3","v":8925},{"$f":"IF(G$2>0,IF(G$2>$A4,IF(G$2>$B4,($B4-$B3)*$C4,(G$2-$B3)*$C4),0),0)","v":0},null,{"$f":"I3+1","v":8926},36250,0.15,{"$f":"J3*I3","v":892.5},{"$f":"I3","v":8925},{"$f":"IF(N$2>0,IF(N$2>$A4,IF(N$2>$B4,($B4-$B3)*$C4,(N$2-$B3)*$C4),0),0)","v":0}]
[{"$f":"B4+1","v":36251},87850,0.25,{"$f":"$D4+$C4*($B4-$B3)","v":4991.25},{"$f":"B4","v":36250},{"$f":"IF(G$2>0,IF(G$2>$A5,IF(G$2>$B5,($B5-$B4)*$C5,(G$2-$B4)*$C5),0),0)","v":0},null,{"$f":"I4+1","v":36251},87850,0.25,{"$f":"$D4+$C4*($B4-$B3)","v":4991.25},{"$f":"I4","v":36250},{"$f":"IF(N$2>0,IF(N$2>$A5,IF(N$2>$B5,($B5-$B4)*$C5,(N$2-$B4)*$C5),0),0)","v":0}]
[87851,183250,0.28000000000000003,{"$f":"$D5+$C5*($B5-$B4)","v":17891.25},{"$f":"B5","v":87850},{"$f":"IF(G$2>0,IF(G$2>$A6,IF(G$2>$B6,($B6-$B5)*$C6,(G$2-$B5)*$C6),0),0)","v":0},null,87851,183250,0.28000000000000003,{"$f":"$D5+$C5*($B5-$B4)","v":17891.25},{"$f":"I5","v":87850},{"$f":"IF(N$2>0,IF(N$2>$A6,IF(N$2>$B6,($B6-$B5)*$C6,(N$2-$B5)*$C6),0),0)","v":0}]
[183251,398350,0.33,{"$f":"$D6+$C6*($B6-$B5)","v":44603.25},{"$f":"B6","v":183250},0,null,183251,398350,0.33,{"$f":"$D6+$C6*($B6-$B5)","v":44603.25},{"$f":"I6","v":183250},0]
[398351,400000,0.36,{"$f":"$D7+$C7*($B7-$B6)","v":115586.25},{"$f":"B7","v":398350},0,null,398351,400000,0.36,{"$f":"$D7+$C7*($B7-$B6)","v":115586.25},{"$f":"I7","v":398350},0]
[400001,null,0.39600000000000002,{"$f":"$D8+$C8*($B8-$B7)","v":116180.25},null,{"$f":"IF(G$2>0,IF(G$2>$A9, (G$2-$B8)*$C9,0),0)","v":0},null,400001,null,0.39600000000000002,{"$f":"$D8+$C8*($B8-$B7)","v":116180.25},null,{"$f":"IF(N$2>0,IF(N$2>$A9, (N$2-$B8)*$C9,0),0)","v":0}]
["Single",null,null,null,"TOTAL TAXES:",{"$f":"SUM(F3:F9)","v":0},null,"Single",null,null,null,"TOTAL TAXES:",{"$f":"SUM(M3:M9)","v":0}]
[]
[]
[0,17850,0.1,null,0,{"$f":"IF(G$2>0,IF(G$2>$B13,$C13*$B13,G$2*$C13),0)","v":0},null,0,17850,0.1,null,0,{"$f":"IF(N$2>0,IF(N$2>$B13,$C13*$B13,N$2*$C13),0)","v":0}]
[{"$f":"B13+1","v":17851},72500,0.15,{"$f":"C13*B13","v":1785},{"$f":"B13","v":17850},{"$f":"IF(G$2>0,IF(G$2>$A14,IF(G$2>$B14,($B14-$B13)*$C14,(G$2-$B13)*$C14),0),0)","v":0},null,{"$f":"I13+1","v":17851},72500,0.15,{"$f":"J13*I13","v":1785},{"$f":"I13","v":17850},{"$f":"IF(N$2>0,IF(N$2>$A14,IF(N$2>$B14,($B14-$B13)*$C14,(N$2-$B13)*$C14),0),0)","v":0}]
[{"$f":"B14+1","v":72501},146400,0.25,{"$f":"$D14+$C14*($B14-$B13)","v":9982.5},{"$f":"B14","v":72500},{"$f":"IF(G$2>0,IF(G$2>$A15,IF(G$2>$B15,($B15-$B14)*$C15,(G$2-$B14)*$C15),0),0)","v":0},null,{"$f":"I14+1","v":72501},146400,0.25,{"$f":"$D14+$C14*($B14-$B13)","v":9982.5},{"$f":"I14","v":72500},{"$f":"IF(N$2>0,IF(N$2>$A15,IF(N$2>$B15,($B15-$B14)*$C15,(N$2-$B14)*$C15),0),0)","v":0}]
[146401,223050,0.28000000000000003,{"$f":"$D15+$C15*($B15-$B14)","v":28457.5},{"$f":"B15","v":146400},{"$f":"IF(G$2>0,IF(G$2>$A16,IF(G$2>$B16,($B16-$B15)*$C16,(G$2-$B15)*$C16),0),0)","v":0},null,146401,223050,0.28000000000000003,{"$f":"$D15+$C15*($B15-$B14)","v":28457.5},{"$f":"I15","v":146400},{"$f":"IF(N$2>0,IF(N$2>$A16,IF(N$2>$B16,($B16-$B15)*$C16,(N$2-$B15)*$C16),0),0)","v":0}]
[223051,398350,0.33,{"$f":"$D16+$C16*($B16-$B15)","v":49919.5},{"$f":"B16","v":223050},0,null,223051,398350,0.33,{"$f":"$D16+$C16*($B16-$B15)","v":49919.5},{"$f":"I16","v":223050},0]
[398351,450000,0.36,{"$f":"$D17+$C17*($B17-$B16)","v":107768.5},{"$f":"B17","v":398350},0,null,398351,450000,0.36,{"$f":"$D17+$C17*($B17-$B16)","v":107768.5},{"$f":"I17","v":398350},0]
[450001,null,0.39600000000000002,{"$f":"$D18+$C18*($B18-$B17)","v":126362.5},null,{"$f":"IF(G$2>0,IF(G$2>$A19, (G$2-$B18)*$C19,0),0)","v":0},null,450001,null,0.39600000000000002,{"$f":"$D18+$C18*($B18-$B17)","v":126362.5},null,{"$f":"IF(N$2>0,IF(N$2>$A19, (N$2-$B18)*$C19,0),0)","v":0}]
["MFJ or QW",null,null,null,"TOTAL TAXES:",{"$f":"SUM(F13:F19)","v":0},null,"MFJ or QW",null,null,null,"TOTAL TAXES:",{"$f":"SUM(M13:M19)","v":0}]
{"$rows_left_out":48}
{"sheet":"Extension Form","index":1,"n_rows":84,"n_cols":8,"rows_kept":84,"cut":false,"hidden":false,"merged":[[1,2,3,2],[23,2,27,2],[8,7,9,7],[51,2,61,2],[41,2,42,2],[44,2,45,2],[44,5,45,5],[44,7,45,7],[18,2,19,2]]}
[null,null,null,"1040 Estimated Tax Return"]
[null,null,"Line # of 1040 Form",null,false]
[null,null,null,null,"Single"]
[null,null,null,"Number of Qualifying Dependents you supported in tax year:",false,null,1]
[null,null,null,"Number of Dependent Children you supported under age 17 by Dec 31st of tax year:",null,null,0]
[null,null,null,"Personal 1040 Tax Return Income Tax Calculation"]
[null,null,null,null,"Invisible Values. Do not delete this row"]
[null,null,7,"Total of all your & your spouses W2s Box 1 (if filing jointly)","Invisible Values. Do not delete this row",null,null,{"$f":"G8","v":0}]
[null,null,"8a","Gross Interest Income ","Invisible Values. Do not delete this row",null,null,{"$f":"G9","v":0}]
[null,null,"8b","Tax-exempt interest (usually federally owned securities like Treasury & Education Bonds)","Invisible Values. Do not delete this row"]
[null,null,"9a","Gross Dividend Income ","Invisible Values. Do not delete this row",null,null,{"$f":"G11","v":0}]
[null,null,10,"State Income Tax Refunds Received in Tax Year","Invisible Values. Do not delete this row",null,null,0]
[null,null,11,"Alimony received (child support is not taxable)","Invisible Values. Do not delete this row",null,null,0]
[null,null,12,"Gross Profits from all Sole Proprietorship You have (losses/profits from corps enter on lne 17)","Invisible Values. Do not delete this row",null,null,0]
[null,null,13,"Capital Gains (Sales this year - Orig Cost), (Stocks, property)","Invisible Values. Do not delete this row",null,null,0]
[null,null,14,"Profit or losses from any sale of business assets in your sole proprietorship","Invisible Values. Do not delete this row",null,null,0]
[null,null,"15a","IRA Distributions (Monies withdrawn from IRA and not reinvested or rolled over)","Invisible Values. Do not delete this row",null,null,0]
[null,null,"16a","Pensions and Annuities Received and taxable","Invisible Values. Do not delete this row",null,null,0]
[null,null,17,"Rental Real Estate Profit (all properties together, net of same depreciation as last year)","Invisible Values. Do not delete this row",null,null,0]
[null,null,null,"Profits from S Corps, trusts, and LLC (add all profits & losses together to net out)","Invisible Values. Do not delete this row",null,null,0]
{"$rows_left_out":65}
{"sheet":"Social Security Worksheet","index":2,"n_rows":35,"n_cols":3,"rows_kept":35,"cut":false,"hidden":true,"merged":[]}
[null,"Social Security Benefits Worksheet -- Lines 20a & 20b"]
[]
[null,"1. Amount from box 5 of all SSA-1099s & RRB 1099s",{"$f":"'Extension Form'!G23","v":0}]
[null,"2. One half of Line 1",{"$f":"0.5*C3","v":0}]
[null,"3. Wages, Taxable Interest, Ordinary Div, Tax Refunds, Alimony, Bus Profits, Cap gains",{"$f":"SUM('Extension Form'!H9:'Extension Form'!H22)+SUM('Extension Form'!H24:'Extension Form'!H26)","v":0}]
[null,"4. Tax Exempt Interest",{"$f":"'Extension Form'!G10","v":0}]
[null,"5. Subtotal",{"$f":"SUM(C4+C5+C6)","v":0}]
[]
[null,"6. Before AGI deductions (except Student loans, tuition, domestic production activities)",{"$f":"SUM('Extension Form'!H32:H42)","v":0}]
[null,"7. If amount of deductions is less than amount of subtotal, then continue..",{"$f":"IF(C9<C7,C7-C9,0)","v":0}]
[null,"    Else STOP here, none of your social security benefits are taxable. Enter 0 on 1040 line 20b."]
[null,"    Subtract \"before AGI deductions\" from Subtotal above."]
[]
[null,"8.  If MFJ, enter $32,000, Single, HOH, QW, or MFS & lived apart from spouse all year, enter $25,000   If MFS, and lived WITH spouse for all of year, skip lines 8 through 15, multiply line 7 above difference by .85 & enter result on line 16. hen go to line 17.",{"$f":"IF(OR('Extension Form'!E3=\"Single\",'Extension Form'!E3=\"HOH\",'Extension Form'!E3=\"QW\",'Extension Form'!E3=\"MFS lived apart from Spouse all year\"),25000,IF('Extension Form'!E3=\"MFJ\",32000,0))","v":25000}]
[]
[null,"9.  Is the amount on line 8 less than the amount on line 7? If no, None of your social security benefits are taxable. ",{"$f":"IF('Extension Form'!E3=\"MFS lived with Spouse\",\"Skip lines 8-15, multiply 7 by 85% & enter on line 16, then go to line 17\",IF(C14<C10,C10-C14,0))","v":0}]
[null,"     If yes, then subtract line 8 from 7."]
[]
[null,"10.  Enter: $12,000 for MFJ, $9,000 for single, HOH, QW, or MFS & lived apart for entire year.",{"$f":"IF('Extension Form'!E3=\"MFS lived with Spouse\",\"Skip lines 8-15, multiply 7 by 85% & enter on line 16, then go to line 17\",IF('Extension Form'!E3=\"MFJ\",12000,IF(OR('Extension Form'!E3=\"Single\",'Extension Form'!E3=\"HOH\",'Extension Form'!E3=\"QW\",'Extension Form'!E3=\"MFS lived apart from Spouse all year\"),9000,0)))","v":9000}]
[]
{"$rows_left_out":16}
{"sheet":"HSA Contribution Deduction Lmts","index":3,"n_rows":5,"n_cols":5,"rows_kept":5,"cut":false,"hidden":true,"merged":[]}
["Year","Single","Family","Personal","Family"]
[2013,3250,6450,true,true]
[2014,3300,6550]
[2015]
["irs "]

{"sheet":"Deduction Worksheet for SE","index":4,"n_rows":28,"n_cols":14,"rows_kept":28,"cut":false,"hidden":true,"merged":[]}
[null,"Rate Table for Self-Employed",null,null,null,null,"Rate Worksheet for Self-Employed",null,null,null,null,null,"Deduction Worksheet for Self-Employed (Publication 560)"]
[null,"Column A","Column B"]
[null,"If plan Contribution Rate is (%)",null,null,null,null,null,null,null,null,null,null,null,"Calcs"]
[null,0.01,{"$f":"$B4/($B4+1)","v":9.9009900990099011E-3},null,null,"Plan Contribution rate as a decimal",null,null,null,{"$f":"'Extension Form'!E38","v":"0.03"},null,"Step 1","Net Profit from Schedule C",{"$f":"'Extension Form'!H14","v":0}]
[null,0.02,1.9607843137254902E-2,null,null,"Rate above plus 1",null,null,null,{"$f":"1+J4","v":1.03},null,"Step 2","SE Tax Deduction",{"$f":"'Extension Form'!H37","v":0}]
[null,0.03,2.9126213592233007E-2,null,null,"Self-employed rate (plan cont/rate plus 1):",null,null,null,{"$f":"J4/J5","v":2.9126213592233007E-2},null,"Step 3","Net earnings from SE",{"$f":"N4-N5","v":0}]
[null,0.04,3.8461538461538464E-2,null,null,null,null,null,null,null,null,"Step 4","Rate from Rate Table or Rate Worksheet",{"$f":"J6","v":2.9126213592233007E-2}]
[null,0.05,4.7619047619047616E-2,null,null,null,null,null,null,null,null,"Step 5","Multiply step 3 by 4",{"$f":"N6*N7","v":0}]
[null,0.06,5.6603773584905655E-2,null,null,null,null,null,null,null,null,"Step 6",{"$f":"\"Multiply \"&DOLLAR('IRS COLA Limits'!F27,0)&\" by your plan contribution rate\"","v":"Multiply $51,000 by your plan contribution rate"},{"$f":"255000*J4","v":7650}]
[null,7.0000000000000007E-2,6.5420560747663559E-2,null,null,null,null,null,null,null,null,"Step 7","Enter smaller of step 5 or 6",{"$f":"MIN($N8,$N9)","v":0}]
[null,0.08,7.407407407407407E-2,null,null,null,null,null,null,null,null,"Step 8","Contribution dollar limit ($50,000 for 2012, $51,000 for 2013)",{"$f":"'IRS COLA Limits'!D27","v":51000}]
[null,0.09,8.2568807339449532E-2,null,null,null,null,null,null,null,null,null,"   If you made any elective deferrals to yoru SE plan, go to step 9, otherwise skip steps 9 thru 20 & enter the smaller of step 7 or step 8 on step 21."]
[null,0.1,9.0909090909090912E-2,null,null,null,null,null,null,null,null,"Step 9","Allowable elective deferrals already done (including designated Roth contrib) (do not enter more than $17,500)",{"$f":"'Extension Form'!G38","v":0}]
[null,0.11,9.9099099099099086E-2,null,null,null,null,null,null,null,null,"Step 10","Subtract step 9 from step 8",{"$f":"IF($N$13<=17500,$N$11-$N$13,$N$11-17500)","v":51000}]
[null,0.12,0.10714285714285712,null,null,null,null,null,null,null,null,"Step 11","Subtract step 9 from step 3",{"$f":"N6-N13","v":0}]
[null,0.13,0.11504424778761063,null,null,null,null,null,null,null,null,"Step 12","Enter one-half of step 11",{"$f":"0.5*N15","v":0}]
[null,0.14000000000000001,0.12280701754385964,null,null,null,null,null,null,null,null,"Step 13","Enter the smallest of step 7 ,10, or 12",{"$f":"MIN(N10,N14,N16)","v":0}]
[null,0.15,0.13043478260869565,null,null,null,null,null,null,null,null,"Step 14","Subtract step 13 from step 3",{"$f":"N6-N17","v":0}]
[null,0.16,0.13793103448275865,null,null,null,null,null,null,null,null,"Step 15","Enter the smaller of step 9 or step 14",{"$f":"MIN(N13,N18)","v":0}]
[null,0.17,0.14529914529914531,null,null,null,null,null,null,null,null,null,"  If you made catch-up contributions, go to step 16, otherwise skip steps 16 thru 18 & go to step 19."]
{"$rows_left_out":9}
{"sheet":"IRS COLA Limits","index":5,"n_rows":37,"n_cols":6,"rows_kept":37,"cut":false,"hidden":true,"merged":[[29,1,29,4],[1,0,1,13],[5,0,5,11],[2,0,4,11],[9,1,9,4],[12,1,12,4],[15,1,15,4],[19,1,19,4],[22,1,22,4],[27,1,28,1]]}
["http://www.irs.gov/Retirement-Plans/COLA-Increases-for-Dollar-Limitations-on-Benefits-and-Contributions"]
["COLA Increases for Dollar Limitations on Benefits and Contributions"]
["The Internal Revenue Code provides for dollar limitations on benefits and contributions under qualified retirement plans. IRC Section 415 requires the limits to be adjusted annually for cost-of-living increases. The IRS announced on October 31, 2013 cost-of-living adjustments applicable to dollar limitations for pension plans and other items for tax year 2014."]
[]
[]
["Please see our COLA Increases Table for prior years' dollar limitations and Internal Revenue Code references."]
[]
[]
[null,null,2014,2013,2012,"Current Values Used"]
[null,"IRAs"]
[null,"IRA Contribution Limit",5500,5500,5000,5500]
[null,"IRA Catch-Up Contributions",1000,1000,1000,1000]
[null,"IRA AGI Deduction Phase-out Starting at"]
[null,"Joint Return",96000,95000,92000,95000]
[null,"Single or Head of Household",60000,59000,58000,59000]
[null,"SEP"]
[null,"SEP Minimum Compensation",550,550,550,550]
[null,"SEP Maximum Contribution",52000,51000,50000,51000]
[null,"SEP Maximum Compensation",260000,255000,250000,255000]
[null,"SIMPLE Plans"]
{"$rows_left_out":18}
{"sheet":"Stud Loan Int & Tuition & Fees ","index":6,"n_rows":75,"n_cols":11,"rows_kept":75,"cut":false,"hidden":true,"merged":[[67,0,67,10],[0,0,0,10],[20,0,20,10],[33,0,33,10],[57,0,57,10],[63,0,63,10]]}
["Student Loan Interest Deduction"]
["Line 1","Enter Total Interest Paid in tax year on a qualified student loan (do NOT enter more than $2,500)",null,null,null,null,null,null,null,null,{"$f":"'Extension Form'!G44","v":0}]
["Line 2","Enter amount from Form 1040, line 22, total income",null,null,null,null,null,null,null,null,{"$f":"'Extension Form'!H29","v":0}]
["Lines 3,4 & 5","Enter total of the amounts from 1040, 23-32, plus any write-in adjustments entered on line 36",null,null,null,null,null,null,null,null,{"$f":"SUM('Extension Form'!H32:'Extension Form'!H42)","v":0}]
["Line 6","Subtract line 3 from 2",null,null,null,null,null,null,null,null,{"$f":"K3-K4","v":0}]
["Line 7","Enter any foreign earned income exclusion and/or housing exclusion (Form 2555, or 2555-EZ)"]
["Line 8","Enter any foreign housing deduciotn (Form 2555)"]
["Line 9","Enter the amount of income from Puerto Rico you are excluding"]
["Line 10","Enter the amount of income from American Samoa you are excluding"]
["Line 11","Add lines 6 through 10. This is the modified adusted gross income (MAGI)",null,null,null,null,null,null,null,null,{"$f":"SUM(K5:K9)","v":0}]
["Line 12","Enter the amount shown below foryour filing status"]
[null,"   - Single, HOH, QW: 60,000",null,null,null,null,null,null,null,null,{"$f":"IF(OR('Extension Form'!E3=\"Single\",'Extension Form'!E3=\"HOH\",'Extension Form'!E3=\"QW\"),60000,IF('Extension Form'!E3=\"MFJ\",125000,0))","v":60000}]
[null,"   - MFJ: $125,000"]
["Line 13","Is amount on line 11 more than amount on line 12?",null,null,null,null,null,null,null,null,{"$f":"IF(K10>K12,K10-K12,0)","v":0}]
[null,"    If no, then Skip lines 13 & 14, enter 0 on line 15, and go to line 16"]
[null,"    If yes, then subtract line 5 from line 4"]
["Line 14","Divide line 13 by $15,000 ($30,000 if MFJ). Enter result as a decimal",null,null,null,null,null,null,null,null,{"$f":"IF(K10>K12,IF('Extension Form'!E3=\"MFJ\",IF(K14/30000>1,1,K14/30000),IF(K14/15000>1,1,K14/15000)),0)","v":0}]
["Line 15","Multiply line 1 by line 14",null,null,null,null,null,null,null,null,{"$f":"K2*K17","v":0}]
["Line 16","Student Loan Interest Deduction (Subtract line 15 from 1. Enter here & on Form 1040 line 33",null,null,null,null,null,null,null,null,{"$f":"K2-K18","v":0}]
[]
{"$rows_left_out":56}
{"sheet":"Dropdowns","index":7,"n_rows":6,"n_cols":1,"rows_kept":6,"cut":false,"hidden":true,"merged":[]}
["Single"]
["HOH"]
["MFJ"]
["QW"]
["MFS lived apart from Spouse all year"]
["MFS lived with Spouse"]

{"sheet":"Child Tax Credit Form","index":8,"n_rows":33,"n_cols":5,"rows_kept":33,"cut":false,"hidden":true,"merged":[]}
["Part I","Line 1","# of qualifying kids under 17 at end of tax year",{"$f":"'Extension Form'!G5","v":0}]
[null,"Line 2","AGI",{"$f":"'Extension Form'!H51","v":0}]
[null,"Line 3","Exclusion of income from Puerto Rico, 2555, etc."]
[null,"Line 4","Add lines 2 & 3",{"$f":"D2+D3","v":0}]
[null,"Line 5","Enter $110,000 for MFJ, $75,000 for Single, HOH, QW, or $55,000 for MFS",{"$f":"IF('Extension Form'!E3=\"MFJ\",110000,75000)","v":75000}]
[null,"Line 6","Is amount from line 4 > line 5? If no, leave line 6 blank, enter 0 on line 7, else, subtract line 5 form 4, and increase it to the next multiple of $1,000. For e.g., increase $425 to $1,000, increase $1,025 to $2,000, etc.",{"$f":"IF(D4>D5,ROUNDUP(D4-D5,-3),0)","v":0}]
[null,"Line 7","Multiply amount on line 6 by 5% (.05). Enter the result.",{"$f":"IF(D4>D5,D6*0.05,0)","v":0}]
[null,"Line 8","Is amount on line 1 more than amount on line 7? If no, no child credit nor additional child credit allowed. If yes, subtract line 7 from 1.",{"$f":"IF(C1>C7,C1-C7,0)","v":0}]
[]
["Part II"]
[null,"Line 9","Enter amount from Form 1040 (line 46, total tax before any credits).",{"$f":"'Extension Form'!H69","v":0}]
[null,"Line 10","Add following amounts from 1040 (line 47,48,49,50,form 5695 line 30, form 8910 line 15, form 8936 line 23, Schedule R line 22)",{"$f":"'Extension Form'!H70","v":0}]
[null,"Line 11","Are you claiming the mortgage interest credit, form 8396, adoption credit, form 8839, residential entery efficient property credit, form 5695, or disctrict of columbia first-time homebuyer credit, form 8859? If no, enter amount from line 10, if yes, complete line 11 Worksheet, later, to figure the amount to enter here. ",{"$f":"D12","v":0},"I HAVE NOT PROGRAMMED THIS LINE. THIS LINE SIMPLY ENTERS AMOUNT FROM LINE ABOVE."]
[null,"Line 12","Subtract line 11 from line 9, enter the result.",{"$f":"D11-D13","v":0}]
[null,"Line 13","Is the amount on line 8 of this worksheet more than the amount on line 12? If no, enter the amount from line 8, if yes, enter the amount from line 12.  THIS IS YOUR CHILD TAX CREDIT. ",{"$f":"IF(D8>D14,D8,0)","v":0}]
[]
[]
["Line 11 Worksheet",null,"TO BE COMPLETED, ONLY IF PERSON HAS TAKEN THE MORTGAGE INTEREST CREDIT, ADOPTION CREDIT, RESIDENTIAL ENERGY EFFICIENT PROPERTY CREDIT, AND DISTRICT OF COLUMBIA FIRST-TIME HOMEBUYER CREDIT."]
[null,"Line 1 ","Enter the amount from line 8 of the Child Tax Credit Worksheet."]
[null,"Line 2","Enter your earned income from the Earned Income Worksheet that applies to you.",null,"I HAVE NOT PROGRAMMED AN EARNED INCOME WORKSHEET; AGAIN THIS LINE 11 WORKSHEET IS ONLY NECESSARY IF TAXPAYER HAS TAKEN THE MORTGAGE INTEREST CREDIT, ADOPTION CREDIT, RESIDENTIAL ENERGY EFFICIENT PROPERTY CREDIT, & DISTRICT OF COLUMBIA FIRST-TIME HOMEBUYER CREDIT."]
{"$rows_left_out":14}
{"sheet":"AMT","index":9,"n_rows":96,"n_cols":6,"rows_kept":96,"cut":false,"hidden":true,"merged":[[66,5,66,10],[67,5,67,10],[68,5,68,10],[8,4,8,10]]}
["Part I"]
[null,"Line 1","1 If filing Schedule A (Form 1040), enter the amount from Form 1040, line 41, and go to line 2. Otherwise, enter the amount from Form 1040, line 38, and go to line 7. (If less than zero, enter as a negative amount.) ",{"$f":"IF('Extension Form'!H62>'Extension Form'!H63,'Extension Form'!H51-'Extension Form'!H64,'Extension Form'!H51)","v":0}]
[null,"Line 2","Medical and dental. If you or your spouse was 65 or older, enter the smaller of Schedule A (Form 1040), line 4, or 2.5% (.025) of Form 1040, line 38. If zero or less, enter -0- . . . . . . . . . . . . ",{"$f":"IF('Extension Form'!H62>'Extension Form'!H63,IF('Extension Form'!E2=TRUE,MIN('Extension Form'!H57,0.025*'Extension Form'!H51),0),0)","v":0},"(ONLY ENTER IF YOU OR YOUR BORN AFTER JAN 2ND, 1949)"]
[null,"Line 3","Taxes from Schedule A (Form 1040), line 9 . . . . . . . . . . . . . . . . . . . . ",{"$f":"IF('Extension Form'!H62>'Extension Form'!H63,'Extension Form'!H54+'Extension Form'!H55+'Extension Form'!H56,0)","v":0}]
[null,"Line 4","Enter the home mortgage interest adjustment, if any, from line 6 of the worksheet in the instructions for this line ",{"$f":"IF('Extension Form'!H62>'Extension Form'!H63,E71,0)","v":0}]
[null,"Line 5","Miscellaneous deductions from Schedule A (Form 1040), line 27. . . . . . . . . . . . . . ",{"$f":"IF('Extension Form'!H62>'Extension Form'!H63,'Extension Form'!H61,0)","v":0}]
[null,"Line 6","If Form 1040, line 38, is $150,000 or less, enter -0-. Otherwise, see instructions . . . . . . . . . ",{"$f":"IF('Extension Form'!H58>'Extension Form'!H59,IF(OR(AND('Extension Form'!E3=\"SINGLE\",'Extension Form'!H51>250000),AND('Extension Form'!E3=\"HOH\",'Extension Form'!H51>275000),AND('Extension Form'!E3=\"MFJ\",'Extension Form'!H51>300000),AND('Extension Form'!E3=\"QW\",'Extension Form'!H51>300000),AND('Extension Form'!E3=\"MFS lived apart form Spouse all year\",'Extension Form'!H51>150000),AND('Extension Form'!E3=\"MFS lived with Spouse\",'Extension Form'!H51>150000)),-D82,0),0)","v":0},"ENTERED AS A NEGATIVE, PER INSTRUCTIONS."]
[null,"Line 7","Tax refund from Form 1040, line 10 or line 21 . . . . . . . . . . . . . . . . . . . ",{"$f":"-'Extension Form'!H12","v":0},"ENTERED AS A NEGATIVE, PER INSTRUCTIONS."]
[null,"Line 8","Investment interest expense (difference between regular tax and AMT). . . . . . . . . . . ",{"$f":"'Extension Form'!H53","v":0},"I have not done a worksheet to calculate 4952 AMT, and have just added the entire investment interest back. Instruction say to add the difference between the 4952 AMT amount and the regular 4952 amount as a negative amount."]
[null,"Line 9","Depletion (difference between regular tax and AMT) . . . . . . . . . . . . . . . . .",0]
[null,"Line 10","Net operating loss deduction from Form 1040, line 21. Enter as a positive amount . . . . . . . . ",{"$f":"'Extension Form'!H27","v":0},"ENTER AS A POSITIVE AMOUNT."]
[null,"Line 11","Alternative tax net operating loss deduction . . . . . . . . . . . . . . . . . . . . ",0,"ENTER AS A NEGATIVE AMOUNT."]
[null,"Line 12","Interest from specified private activity bonds exempt from the regular tax . . . . . . . . . . ",0]
[null,"Line 13","Qualified small business stock (7% of gain excluded under section 1202) . . . . . . . . . . ",0]
[null,"Line 14","Exercise of incentive stock options (excess of AMT income over regular tax income) . . . . . . . . ",0]
[null,"Line 15","Estates and trusts (amount from Schedule K-1 (Form 1041), box 12, code A) . . . . . . .",0]
[null,"Line 16","Electing large partnerships (amount from Schedule K-1 (Form 1065-B), box 6) . . . . . .",0]
[null,"Line 17","Disposition of property (difference between AMT and regular tax gain or loss) . . . . . . .",0,"ENTER DIFFERENCE AS A NEGATIVE AMOUNT."]
[null,"Line 18","Depreciation on assets placed in service after 1986 (difference between regular tax and AMT) . . . . ",0,"ENTER DIFFERENCE AS A NEGATIVE AMOUNT."]
[null,"Line 19","Passive activities (difference between AMT and regular tax income or loss) . . . . . . . . .",0,"ENTER DIFFERENCE AS A NEGATIVE AMOUNT."]
{"$rows_left_out":76}